Reaction Details
TargetProteinase-activated receptor 1
LigandBDBM230742
Substrate/Competitorn/a
Meas. Tech.FLIPR Assay
IC50 1.2±n/a nM
Citation Mandal, MBlizzard, TAChen, HChobanian, HGuo, YPio, BWu, ZBiftu, TGreenlee, WJZhu, JZ Preparation and use of bicyclic himbacine derivatives as PAR-1 receptor antagonists US Patent US9340530 Publication Date 5/17/2016
 
Proteinase-activated receptor 1
Name:Proteinase-activated receptor 1
Type:Protein
Mol. Mass.:47450.07
Organism:Homo sapiens (Human)
Description:P25116
Residue:425
BDBM230742
NameBDBM230742
Synonyms:US9340530, 77
TypeSmall organic molecule
Emp. Form.C26H27F2N3O2
Mol. Mass.451.5083
SMILESC[C@H]1OC(=O)[C@]2(CN)CC(F)(F)[C@@H](C)[C@H](\C=C\c3ccc(cn3)-c3cccc(C)c3C#N)C12