Reaction Details
TargetProteinase-activated receptor 1
LigandBDBM230743
Substrate/Competitorn/a
Meas. Tech.FLIPR Assay
IC50 1.5±n/a nM
Citation Mandal, MBlizzard, TAChen, HChobanian, HGuo, YPio, BWu, ZBiftu, TGreenlee, WJZhu, JZ Preparation and use of bicyclic himbacine derivatives as PAR-1 receptor antagonists US Patent US9340530 Publication Date 5/17/2016
 
Proteinase-activated receptor 1
Name:Proteinase-activated receptor 1
Type:Protein
Mol. Mass.:47450.07
Organism:Homo sapiens (Human)
Description:P25116
Residue:425
BDBM230743
NameBDBM230743
Synonyms:US9340530, 78
TypeSmall organic molecule
Emp. Form.C24H23F2N3O
Mol. Mass.407.4557
SMILESC[C@H]1NC(=O)C2CC(F)(F)[C@@H](C)[C@H](\C=C\c3ccc(cn3)-c3ccccc3C#N)C12