Reaction Details
TargetSodium/potassium-transporting ATPase subunit alpha-1/beta-1
LigandBDBM231650
Substrate/Competitorn/a
Meas. Tech.Na,K-ATPase Inhibition Assay
Ki 311±18.5 nM
Citation Katz, ATal, DMHeller, DHaviv, HRabah, BBarkana, YMarcovich, ALKarlish, SJ Digoxin derivatives with enhanced selectivity for the a2 isoform of Na,K-ATPase: effects on intraocular pressure in rabbits. J Biol Chem289:21153-62 (2014) 
 
Sodium/potassium-transporting ATPase subunit alpha-1/beta-1
Name:Sodium/potassium-transporting ATPase subunit alpha-1/beta-1
Type:Protein
Mol. Mass.:n/a
Description:n/a
Components:This complex has 2 components.
Component 1
Name:Sodium/potassium-transporting ATPase subunit alpha-1
Synonyms:AT1A1_HUMAN Na(+)/K(+) ATPase alpha-1 subunit Sodium pump subunit alpha-1 | Sodium/potassium-transporting ATPase subunit alpha-1
Type:Enzyme
Mol. Mass.:112879.20
Organism:Homo sapiens (Human)
Description:P05023
Residue:1023
Component 2
Name:Sodium/potassium-transporting ATPase subunit beta-1
Synonyms:AT1B1_HUMAN ATP1B1 | Na,K-ATPase isoform beta-1 (β1)
Type:Enzyme
Mol. Mass.:35067.44
Organism:Homo sapiens (Human)
Description:P05026
Residue:303
BDBM231650
NameBDBM231650
Synonyms:DOH (1)
TypeSmall organic molecule
Emp. Form.C41H65NO13
Mol. Mass.779.9537
SMILESC[C@@H]1O[C@H](C[C@H](O)[C@@H]1O[C@H]1C[C@H](O)[C@H](OC2CCN(O)CC(C)O2)[C@H](C)O1)O[C@H]1CC[C@@]2(C)C(CCC3C2C[C@H](O)[C@]2(C)[C@H](CC[C@]32O)C2=CC(=O)OC2)C1