Reaction Details
TargetSodium/potassium-transporting ATPase subunit alpha-1/beta-1
LigandBDBM231661
Substrate/Competitorn/a
Meas. Tech.Na,K-ATPase Inhibition Assay
Ki 53±3.4 nM
Citation Katz, ATal, DMHeller, DHaviv, HRabah, BBarkana, YMarcovich, ALKarlish, SJ Digoxin derivatives with enhanced selectivity for the a2 isoform of Na,K-ATPase: effects on intraocular pressure in rabbits. J Biol Chem289:21153-62 (2014) 
 
Sodium/potassium-transporting ATPase subunit alpha-1/beta-1
Name:Sodium/potassium-transporting ATPase subunit alpha-1/beta-1
Type:Protein
Mol. Mass.:n/a
Description:n/a
Components:This complex has 2 components.
Component 1
Name:Sodium/potassium-transporting ATPase subunit alpha-1
Synonyms:AT1A1_HUMAN Na(+)/K(+) ATPase alpha-1 subunit Sodium pump subunit alpha-1 | Sodium/potassium-transporting ATPase subunit alpha-1
Type:Enzyme
Mol. Mass.:112879.20
Organism:Homo sapiens (Human)
Description:P05023
Residue:1023
Component 2
Name:Sodium/potassium-transporting ATPase subunit beta-1
Synonyms:AT1B1_HUMAN ATP1B1 | Na,K-ATPase isoform beta-1 (β1)
Type:Enzyme
Mol. Mass.:35067.44
Organism:Homo sapiens (Human)
Description:P05026
Residue:303
BDBM231661
NameBDBM231661
Synonyms:DEt (12) | US10668094, Compound DEt
TypeSmall organic molecule
Emp. Form.C43H69NO12
Mol. Mass.792.0075
SMILESCCN1CCC(O[C@H]2[C@@H](O)C[C@H](O[C@H]3[C@@H](O)C[C@H](O[C@H]4CC[C@@]5(C)C(CCC6C5C[C@H](O)[C@]5(C)[C@H](CC[C@]65O)C5=CC(=O)OC5)C4)O[C@H]3C)O[C@H]2C)OC(C)C1