Reaction Details
TargetHeme-binding protein HutZ
LigandBDBM231681
Substrate/Competitorn/a
Meas. Tech.Heme Binding Assay
pH6±0
Kd 1.3e+2± 6e+1 nM
Citation Uchida, TDojun, NSekine, YIshimori, K Heme Proximal Hydrogen Bonding between His170 and Asp132 Plays an Essential Role in the Heme Degradation Reaction of HutZ from Vibrio cholerae. Biochemistry56:2723-2734 (2017) 
 
Heme-binding protein HutZ
Name:Heme-binding protein HutZ
Synonyms:Heme-binding protein HutZ (HutZ)
Type:Protein
Mol. Mass.:20304.27
Organism:Vibrio cholerae
Description:C3LWH1
Residue:176
BDBM231681
NameBDBM231681
Synonyms:Hemin
TypeSmall organic molecule
Emp. Form.C34H32N4O4
Mol. Mass.560.6434
SMILESCc1c(CCC(O)=O)c2cc3[n-]c(cc4nc(cc5[n-]c(cc1n2)c(C)c5C=C)c(C)c4C=C)c(C)c3CCC(O)=O