Reaction Details
TargetSecreted cathepsin L 1
LigandBDBM232208
Substrate/Competitorn/a
Meas. Tech.Cathepsin L Enzyme Assay
IC50 3.95e+4±n/a nM
Citation Moran, BWAnderson, FPRuth, DMFágáin, CODalton, JPKenny, PT Fluorobenzoyl dipeptidyl derivatives as inhibitors of the Fasciola hepatica cysteine protease cathepsin L1. J Enzyme Inhib Med Chem25:1-12 (2010) 
 
Secreted cathepsin L 1
Name:Secreted cathepsin L 1
Type:Protein
Mol. Mass.:36773.95
Organism:Fasciola hepatica (Liver fluke)
Description:n/a
Residue:326
BDBM232208
NameBDBM232208
Synonyms:N-pentafluorobenzoyl-L-leucine-glycine benzyl ester (4)
TypeSmall organic molecule
Emp. Form.C21H19F5N2O4
Mol. Mass.458.3786
SMILESCC(C)C[C@H](NC(=O)c1c(F)c(F)c(F)c(F)c1F)C(=O)NCC(=O)Oc1ccccc1