Reaction Details
TargetSecreted cathepsin L 1
LigandBDBM232213
Substrate/Competitorn/a
Meas. Tech.Cathepsin L Enzyme Assay
IC50 1.53e+4±n/a nM
Citation Moran, BWAnderson, FPRuth, DMFágáin, CODalton, JPKenny, PT Fluorobenzoyl dipeptidyl derivatives as inhibitors of the Fasciola hepatica cysteine protease cathepsin L1. J Enzyme Inhib Med Chem25:1-12 (2010) 
 
Secreted cathepsin L 1
Name:Secreted cathepsin L 1
Type:Protein
Mol. Mass.:36773.95
Organism:Fasciola hepatica (Liver fluke)
Description:n/a
Residue:326
BDBM232213
NameBDBM232213
Synonyms:N-2-fluorobenzoyl-L-leucine-γ-aminobutyric acid benzyl ester (9)
TypeSmall organic molecule
Emp. Form.C23H27FN2O4
Mol. Mass.414.4699
SMILESCC(C)C[C@H](NC(=O)c1ccccc1F)C(=O)NCCCC(=O)Oc1ccccc1