Reaction Details
TargetSecreted cathepsin L 1
LigandBDBM232218
Substrate/Competitorn/a
Meas. Tech.Cathepsin L Enzyme Assay
IC50 2.8e+3±n/a nM
Citation Moran, BWAnderson, FPRuth, DMFágáin, CODalton, JPKenny, PT Fluorobenzoyl dipeptidyl derivatives as inhibitors of the Fasciola hepatica cysteine protease cathepsin L1. J Enzyme Inhib Med Chem25:1-12 (2010) 
 
Secreted cathepsin L 1
Name:Secreted cathepsin L 1
Type:Protein
Mol. Mass.:36773.95
Organism:Fasciola hepatica (Liver fluke)
Description:n/a
Residue:326
BDBM232218
NameBDBM232218
Synonyms:N-4-fluorobenzoyl-L-leucine-glycine nitrile (14)
TypeSmall organic molecule
Emp. Form.C15H18FN3O2
Mol. Mass.291.3207
SMILESCCC(C)[C@H](NC(=O)c1ccc(F)cc1)C(=O)NCC#N