Reaction Details
TargetSecreted cathepsin L 1
LigandBDBM232231
Substrate/Competitorn/a
Meas. Tech.Cathepsin L Enzyme Assay
IC50 3.0e+3±n/a nM
Citation Moran, BWAnderson, FPRuth, DMFágáin, CODalton, JPKenny, PT Fluorobenzoyl dipeptidyl derivatives as inhibitors of the Fasciola hepatica cysteine protease cathepsin L1. J Enzyme Inhib Med Chem25:1-12 (2010) 
 
Secreted cathepsin L 1
Name:Secreted cathepsin L 1
Type:Protein
Mol. Mass.:36773.95
Organism:Fasciola hepatica (Liver fluke)
Description:n/a
Residue:326
BDBM232231
NameBDBM232231
Synonyms:N-3,5-difluorobenzoyl-L-leucine-glycine nitrile (27)
TypeSmall organic molecule
Emp. Form.C15H17F2N3O2
Mol. Mass.309.3112
SMILESCC(C)C[C@H](NC(=O)c1cc(F)cc(F)c1)C(=O)NCC#N