Reaction Details
TargetSecreted cathepsin L 1
LigandBDBM232233
Substrate/Competitorn/a
Meas. Tech.Cathepsin L Enzyme Assay
IC50 4.1e+3±n/a nM
Citation Moran, BWAnderson, FPRuth, DMFágáin, CODalton, JPKenny, PT Fluorobenzoyl dipeptidyl derivatives as inhibitors of the Fasciola hepatica cysteine protease cathepsin L1. J Enzyme Inhib Med Chem25:1-12 (2010) 
 
Secreted cathepsin L 1
Name:Secreted cathepsin L 1
Type:Protein
Mol. Mass.:36773.95
Organism:Fasciola hepatica (Liver fluke)
Description:n/a
Residue:326
BDBM232233
NameBDBM232233
Synonyms:N-2,3,4-trifluorobenzoyl-L-leucine-glycine nitrile (29)
TypeSmall organic molecule
Emp. Form.C15H16F3N3O2
Mol. Mass.327.3016
SMILESCC(C)C[C@H](NC(=O)c1ccc(F)c(F)c1F)C(=O)NCC#N