Reaction Details
TargetTyrosine-protein kinase JAK1
LigandBDBM232511
Substrate/Competitorn/a
Meas. Tech.JAK Enzyme Assay
pH7.2±n/a
Temperature295.15±n/a K
Ki 0.59±n/a nM
Commentsextracted
Citation Zak, MERay, NCGoodacre, SCMendonca, RKellar, TCheng, YLi, WYuen, P 5-chloro-2-difluoromethoxyphenyl pyrazolopyrimidine compounds, compositions and methods of use thereof US Patent US9346815 Publication Date 5/24/2016
 
Tyrosine-protein kinase JAK1
Name:Tyrosine-protein kinase JAK1
Type:Protein
Mol. Mass.:133293.73
Organism:Homo sapiens (Human)
Description:P23458
Residue:1154
BDBM232511
NameBDBM232511
Synonyms:US9346815, 57 | US9604984, Example 57
TypeSmall organic molecule
Emp. Form.C29H30ClF2N9O3
Mol. Mass.626.057
SMILESNc1nn2cccnc2c1C(=O)Nc1cn(CC(=O)N2C[C@@H]3CN(CC4CC4)C[C@@H]3C2)nc1-c1cc(Cl)ccc1OC(F)F