Reaction Details
TargetTyrosine-protein kinase JAK1
LigandBDBM232600
Substrate/Competitorn/a
Meas. Tech.JAK Enzyme Assay
pH7.2±n/a
Temperature295.15±n/a K
Ki 0.45±n/a nM
Commentsextracted
Citation Zak, MERay, NCGoodacre, SCMendonca, RKellar, TCheng, YLi, WYuen, P 5-chloro-2-difluoromethoxyphenyl pyrazolopyrimidine compounds, compositions and methods of use thereof US Patent US9346815 Publication Date 5/24/2016
 
Tyrosine-protein kinase JAK1
Name:Tyrosine-protein kinase JAK1
Type:Protein
Mol. Mass.:133293.73
Organism:Homo sapiens (Human)
Description:P23458
Residue:1154
BDBM232600
NameBDBM232600
Synonyms:US9346815, 146 | US9604984, Example 146
TypeSmall organic molecule
Emp. Form.C29H32ClF2N9O3
Mol. Mass.628.073
SMILESNc1nn2cccnc2c1C(=O)Nc1cn(nc1-c1cc(Cl)ccc1OC(F)F)C1CCN(CCCN2CCCC2=O)CC1