Reaction Details
TargetTyrosine-protein kinase JAK1
LigandBDBM232744
Substrate/Competitorn/a
Meas. Tech.JAK Enzyme Assay
pH7.2±n/a
Temperature295.15±n/a K
Ki 0.24±n/a nM
Commentsextracted
Citation Zak, MERay, NCGoodacre, SCMendonca, RKellar, TCheng, YLi, WYuen, P 5-chloro-2-difluoromethoxyphenyl pyrazolopyrimidine compounds, compositions and methods of use thereof US Patent US9346815 Publication Date 5/24/2016
 
Tyrosine-protein kinase JAK1
Name:Tyrosine-protein kinase JAK1
Type:Protein
Mol. Mass.:133293.73
Organism:Homo sapiens (Human)
Description:P23458
Residue:1154
BDBM232744
NameBDBM232744
Synonyms:US9346815, 290 | US9604984, Example 290
TypeSmall organic molecule
Emp. Form.C23H21ClF2N8O4
Mol. Mass.546.914
SMILESNc1nn2cccnc2c1C(=O)Nc1cn(CC(=O)N2CCOCC2)nc1-c1cc(Cl)ccc1OC(F)F