Reaction Details
TargetTyrosine-protein kinase JAK2
LigandBDBM232597
Substrate/Competitorn/a
Meas. Tech.JAK Enzyme Assay
pH7.2±n/a
Temperature295.15±n/a K
Ki 0.18±n/a nM
Commentsextracted
Citation Zak, MERay, NCGoodacre, SCMendonca, RKellar, TCheng, YLi, WYuen, P 5-chloro-2-difluoromethoxyphenyl pyrazolopyrimidine compounds, compositions and methods of use thereof US Patent US9346815 Publication Date 5/24/2016
 
Tyrosine-protein kinase JAK2
Name:Tyrosine-protein kinase JAK2
Type:Protein
Mol. Mass.:130684.68
Organism:Homo sapiens (Human)
Description:O60674
Residue:1132
BDBM232597
NameBDBM232597
Synonyms:US9346815, 143 | US9604984, Example 143
TypeSmall organic molecule
Emp. Form.C31H36ClF2N9O3
Mol. Mass.656.126
SMILESNc1nn2cccnc2c1C(=O)Nc1cn(nc1-c1cc(Cl)ccc1OC(F)F)C1CCN(CCCC(=O)N2CCCCC2)CC1