Reaction Details
TargetTyrosine-protein kinase JAK2
LigandBDBM232618
Substrate/Competitorn/a
Meas. Tech.JAK Enzyme Assay
pH7.2±n/a
Temperature295.15±n/a K
Ki 0.06±n/a nM
Commentsextracted
Citation Zak, MERay, NCGoodacre, SCMendonca, RKellar, TCheng, YLi, WYuen, P 5-chloro-2-difluoromethoxyphenyl pyrazolopyrimidine compounds, compositions and methods of use thereof US Patent US9346815 Publication Date 5/24/2016
 
Tyrosine-protein kinase JAK2
Name:Tyrosine-protein kinase JAK2
Type:Protein
Mol. Mass.:130684.68
Organism:Homo sapiens (Human)
Description:O60674
Residue:1132
BDBM232618
NameBDBM232618
Synonyms:US9346815, 164 | US9604984, Example 164
TypeSmall organic molecule
Emp. Form.C29H33ClF2N10O3
Mol. Mass.643.087
SMILESCN1CCN(CCCN2CCC(CC2)n2cc(NC(=O)c3c(N)nn4cccnc34)c(n2)-c2cc(Cl)ccc2OC(F)F)C1=O