Reaction Details
TargetTyrosine-protein kinase JAK2
LigandBDBM232706
Substrate/Competitorn/a
Meas. Tech.JAK Enzyme Assay
pH7.2±n/a
Temperature295.15±n/a K
Ki 0.15±n/a nM
Commentsextracted
Citation Zak, MERay, NCGoodacre, SCMendonca, RKellar, TCheng, YLi, WYuen, P 5-chloro-2-difluoromethoxyphenyl pyrazolopyrimidine compounds, compositions and methods of use thereof US Patent US9346815 Publication Date 5/24/2016
 
Tyrosine-protein kinase JAK2
Name:Tyrosine-protein kinase JAK2
Type:Protein
Mol. Mass.:130684.68
Organism:Homo sapiens (Human)
Description:O60674
Residue:1132
BDBM232706
NameBDBM232706
Synonyms:US9346815, 252 | US9604984, Example 252
TypeSmall organic molecule
Emp. Form.C25H24ClF2N9O3
Mol. Mass.571.966
SMILESCN1C[C@H]2C[C@@H]1CN2C(=O)Cn1cc(NC(=O)c2c(N)nn3cccnc23)c(n1)-c1cc(Cl)ccc1OC(F)F