Reaction Details
TargetTyrosine-protein kinase JAK2
LigandBDBM232781
Substrate/Competitorn/a
Meas. Tech.JAK Enzyme Assay
pH7.2±n/a
Temperature295.15±n/a K
Ki 0.2±n/a nM
Commentsextracted
Citation Zak, MERay, NCGoodacre, SCMendonca, RKellar, TCheng, YLi, WYuen, P 5-chloro-2-difluoromethoxyphenyl pyrazolopyrimidine compounds, compositions and methods of use thereof US Patent US9346815 Publication Date 5/24/2016
 
Tyrosine-protein kinase JAK2
Name:Tyrosine-protein kinase JAK2
Type:Protein
Mol. Mass.:130684.68
Organism:Homo sapiens (Human)
Description:O60674
Residue:1132
BDBM232781
NameBDBM232781
Synonyms:US9346815, 327 | US9604984, Example 327
TypeSmall organic molecule
Emp. Form.C26H22ClF2N7O3
Mol. Mass.553.948
SMILESOc1cccc(CNCCn2cc(NC(=O)c3cnn4cccnc34)c(n2)-c2cc(Cl)ccc2OC(F)F)c1