Reaction Details
TargetCarboxylic ester hydrolase
LigandBDBM232995
Substrate/Competitorn/a
Meas. Tech.BChE Inhibition Assay
pH7±0
Temperature298.15±0 K
Ki 11±2 nM
Citation Chiou, SYHuang, CFYeh, SJChen, IRLin, G Stereoselective inhibition of butyrylcholinesterase by enantiomers of exo- and endo-2-norbornyl-N-n-butylcarbamates. J Enzyme Inhib Med Chem25:13-20 (2010) 
 
Carboxylic ester hydrolase
Name:Carboxylic ester hydrolase
Type:Protein
Mol. Mass.:68842.83
Organism:Equus caballus (Horse)
Description:Q9N1N9
Residue:602
BDBM232995
NameBDBM232995
Synonyms:(R)-(+)-exo-2-norbonyl-N-n-butylcarbamate
TypeSmall organic molecule
Emp. Form.C12H21NO2
Mol. Mass.211.3006
SMILESCCCCNC(=O)OC1CC2CCC1C2