Reaction Details
Target3-oxoacyl-[acyl-carrier-protein] synthase 3
LigandBDBM233057
Substrate/Competitorn/a
Meas. Tech.3D-QSAR
IC50 7000±n/a nM
Citation Lu, XChen, YYou, Q 3D-QSAR, molecular docking studies, and binding mode prediction of thiolactomycin analogs as mtFabH inhibitors. J Enzyme Inhib Med Chem25:240-9 (2010) 
 
3-oxoacyl-[acyl-carrier-protein] synthase 3
Name:3-oxoacyl-[acyl-carrier-protein] synthase 3
Type:Enzyme
Mol. Mass.:34865.07
Organism:Mycobacterium tuberculosis
Description:P9WNG3
Residue:335
BDBM233057
NameBDBM233057
Synonyms:mtFabH inhibitor, 4
TypeSmall organic molecule
Emp. Form.C16H14O4S
Mol. Mass.302.345
SMILESCC(=O)c1ccc(cc1O)C#CC1(C)SC(=O)C(C)=C1O