Reaction Details
Target3-oxoacyl-[acyl-carrier-protein] synthase 3
LigandBDBM233070
Substrate/Competitorn/a
Meas. Tech.3D-QSAR
IC50 17000±n/a nM
Citation Lu, XChen, YYou, Q 3D-QSAR, molecular docking studies, and binding mode prediction of thiolactomycin analogs as mtFabH inhibitors. J Enzyme Inhib Med Chem25:240-9 (2010) 
 
3-oxoacyl-[acyl-carrier-protein] synthase 3
Name:3-oxoacyl-[acyl-carrier-protein] synthase 3
Type:Enzyme
Mol. Mass.:34865.07
Organism:Mycobacterium tuberculosis
Description:P9WNG3
Residue:335
BDBM233070
NameBDBM233070
Synonyms:mtFabH inhibitor, 24
TypeSmall organic molecule
Emp. Form.C27H26O3S
Mol. Mass.430.559
SMILESCC1=C(O)C(C)(Cc2ccc(cc2)-c2ccc(COCc3ccccc3)cc2)SC1=O