Reaction Details
TargetEpidermal growth factor receptor
LigandBDBM4810
Substrate/Competitorn/a
Meas. Tech.EGFR Tyrosine Kinase Activity Assay
pH7.5±n/a
IC50 16600±n/a nM
Commentsextracted
Citation Garofalo, AGoossens, LLemoine, AFarce, AArlot, YDepreux, P Quinazoline-urea, new protein kinase inhibitors in treatment of prostate cancer. J Enzyme Inhib Med Chem25:158-71 (2010) 
 
Epidermal growth factor receptor
Name:Epidermal growth factor receptor
Type:Receptor Kinase Domain
Mol. Mass.:134279.59
Organism:Homo sapiens (Human)
Description:P00533
Residue:1210
BDBM4810
NameBDBM4810
Synonyms:(3Z)-3-[(3,5-dimethyl-1H-pyrrol-2-yl)methylidene]-2,3-dihydro-1H-indol-2-one CHEMBL276711 SU5416 US10189853, semaxanib US9422297, SU5416 | cid_5329098
TypeSmall organic molecule
Emp. Form.C15H14N2O
Mol. Mass.238.2845
SMILESCc1cc(C)c(\C=C2/C(=O)Nc3ccccc23)[nH]1