Reaction Details
TargetUrease
LigandBDBM50067884
Substrate/Competitorn/a
Meas. Tech.Urease Inhibition Assay
pH7±n/a
Temperature310.15±n/a K
Ki 1.500e+6± 1.00e+5 nM
Commentsextracted
Citation Kumar, SKayastha, AM Inhibition studies of soybean (Glycine max) urease with heavy metals, sodium salts of mineral acids, boric acid, and boronic acids. J Enzyme Inhib Med Chem25:646-52 (2010) 
 
Urease
Name:Urease
Synonyms:n/a
Type:Enzyme
Mol. Mass.:90703.11
Organism:Glycine max (Soybean)
Description:Q949H4
Residue:837
BDBM50067884
NameBDBM50067884
TypeSmall organic molecule
Emp. Form.C4H11BO2
Mol. Mass.101.94
SMILESCCCCB(O)O