Reaction Details
TargetSerine/threonine-protein kinase pim-2
LigandBDBM161986
Substrate/Competitorn/a
Meas. Tech.PIM-2 Biochemical Assay
IC50<100±n/a nM
Citation Pastor Fernández, JRamos Lima, FJHernandez Higueras, AIMartínez González, SMartín Hernando, JISaluste, CPGonzalez Cantalapiedra, EBlanco Aparicio, CRodríguez Hergueta, AGarcia Collazo, AMSalgado Serrano, ANoya Marino, B Tricyclic compounds for use as kinase inhibitors US Patent US9682991 Publication Date 6/20/2017
 
Serine/threonine-protein kinase pim-2
Name:Serine/threonine-protein kinase pim-2
Type:Serine/threonine-protein kinase
Mol. Mass.:34185.93
Organism:Homo sapiens (Human)
Description:Q9P1W9
Residue:311
BDBM161986
NameBDBM161986
Synonyms:US9682991, 35
TypeSmall organic molecule
Emp. Form.C22H25F3N6O3
Mol. Mass.478.4675
SMILESCN([C@H]1CC[C@H](O)CC1)c1nn2c(nnc2c2OCCN(C)c12)-c1cccc(OC(F)(F)F)c1