Reaction Details
TargetSerine/threonine-protein kinase pim-3
LigandBDBM161991
Substrate/Competitorn/a
Meas. Tech.PIM-3 Biochemical Assay
IC50<100±n/a nM
Citation Pastor Fernández, JRamos Lima, FJHernandez Higueras, AIMartínez González, SMartín Hernando, JISaluste, CPGonzalez Cantalapiedra, EBlanco Aparicio, CRodríguez Hergueta, AGarcia Collazo, AMSalgado Serrano, ANoya Marino, B Tricyclic compounds for use as kinase inhibitors US Patent US9682991 Publication Date 6/20/2017
 
Serine/threonine-protein kinase pim-3
Name:Serine/threonine-protein kinase pim-3
Type:Protein
Mol. Mass.:35888.19
Organism:Homo sapiens (Human)
Description:Q86V86
Residue:326
BDBM161991
NameBDBM161991
Synonyms:US9682991, 40
TypeSmall organic molecule
Emp. Form.C23H28F3N7O2
Mol. Mass.491.5093
SMILESCC1CN(C)c2c(NCC3CCN(C)CC3)nn3c(nnc3c2O1)-c1cccc(OC(F)(F)F)c1