Reaction Details
TargetSerine/threonine-protein kinase pim-1
LigandBDBM162029
Substrate/Competitorn/a
Meas. Tech.PIM-1 Biochemical Assay
IC50<100±n/a nM
Citation Pastor Fernández, JRamos Lima, FJHernandez Higueras, AIMartínez González, SMartín Hernando, JISaluste, CPGonzalez Cantalapiedra, EBlanco Aparicio, CRodríguez Hergueta, AGarcia Collazo, AMSalgado Serrano, ANoya Marino, B Tricyclic compounds for use as kinase inhibitors US Patent US9682991 Publication Date 6/20/2017
 
Serine/threonine-protein kinase pim-1
Name:Serine/threonine-protein kinase pim-1
Type:Protein
Mol. Mass.:35681.82
Organism:Homo sapiens (Human)
Description:P11309
Residue:313
BDBM162029
NameBDBM162029
Synonyms:US9682991, 85
TypeSmall organic molecule
Emp. Form.C24H30F3N7O2
Mol. Mass.505.5359
SMILESCC(C)NCC1CCN(CC1)c1nn2c(nnc2c2OCCN(C)c12)-c1cccc(OC(F)(F)F)c1