Reaction Details
TargetSerine/threonine-protein kinase pim-1
LigandBDBM162038
Substrate/Competitorn/a
Meas. Tech.PIM-1 Biochemical Assay
IC50<100±n/a nM
Citation Pastor Fernández, JRamos Lima, FJHernandez Higueras, AIMartínez González, SMartín Hernando, JISaluste, CPGonzalez Cantalapiedra, EBlanco Aparicio, CRodríguez Hergueta, AGarcia Collazo, AMSalgado Serrano, ANoya Marino, B Tricyclic compounds for use as kinase inhibitors US Patent US9682991 Publication Date 6/20/2017
 
Serine/threonine-protein kinase pim-1
Name:Serine/threonine-protein kinase pim-1
Type:Protein
Mol. Mass.:35681.82
Organism:Homo sapiens (Human)
Description:P11309
Residue:313
BDBM162038
NameBDBM162038
Synonyms:US9682991, 94
TypeSmall organic molecule
Emp. Form.C22H22FN7O
Mol. Mass.419.4548
SMILESCN1CCN(C)c2c1c(NCc1ccc(F)cc1)nn1c(nnc21)-c1ccc(O)cc1