Reaction Details
TargetPeroxisome proliferator-activated receptor gamma
LigandBDBM50030474
Substrate/Competitorn/a
Meas. Tech.Pharmacological In Vitro Assay
pH8.2±n/a
Temperature277.15±n/a K
Ki 8±0.0 nM
Commentsextracted
Citation Liutkus, MCaijo, FGirard, ALAyral, EAudinot, VBoutin, JARenard, PCaignard, DHDacquet, CKtorza, AMosset, PGrée, R Synthesis of new 8(S)-HETE analogs and their biological evaluation as activators of the PPAR nuclear receptors. J Enzyme Inhib Med Chem25:653-72 (2010) 
 
Peroxisome proliferator-activated receptor gamma
Name:Peroxisome proliferator-activated receptor gamma
Type:Nuclear Receptor
Mol. Mass.:57613.46
Organism:Homo sapiens (Human)
Description:P37231
Residue:505
BDBM50030474
NameBDBM50030474
Synonyms:Avandamet Avandia CHEBI:50122 US10744117, Compound Rosiglitazone | US9562012, rosiglitazone
TypeSmall organic molecule
Emp. Form.C18H19N3O3S
Mol. Mass.357.427
SMILESCN(CCOc1ccc(CC2SC(=O)NC2=O)cc1)c1ccccn1