Reaction Details
TargetTyrosine-protein kinase JAK1
LigandBDBM292105
Substrate/Competitorn/a
Meas. Tech.Biochemical JAK and Off-Target Kinase Assays
pH7.5±n/a
Ki<0.1±n/a nM
Commentsextracted
Citation Fatheree, PRJacobsen, JRBeausoleil, ABrandt, GEFleury, MJiang, LSmith, CSullivan, SDVan Orden, LJ JAK kinase inhibitor compounds for treatment of respiratory disease US Patent US10100049 Publication Date 10/16/2018
 
Tyrosine-protein kinase JAK1
Name:Tyrosine-protein kinase JAK1
Type:Protein
Mol. Mass.:133293.73
Organism:Homo sapiens (Human)
Description:P23458
Residue:1154
BDBM292105
NameBDBM292105
Synonyms:US10100049, Example 2 US10526330, Example 2 US11299492, Example 2 | US11718616, Example 2
TypeSmall organic molecule
Emp. Form.C24H25FN6O
Mol. Mass.432.4933
SMILESCCc1cc(O)c(F)cc1-c1ccc2c(n[nH]c2c1)-c1nc2CN(CCc2[nH]1)C1CNC1