Reaction Details
TargetTyrosine-protein kinase JAK2
LigandBDBM292120
Substrate/Competitorn/a
Meas. Tech.Biochemical JAK and Off-Target Kinase Assays
pH7.5±n/a
Ki<0.1±n/a nM
Commentsextracted
Citation Fatheree, PRJacobsen, JRBeausoleil, ABrandt, GEFleury, MJiang, LSmith, CSullivan, SDVan Orden, LJ JAK kinase inhibitor compounds for treatment of respiratory disease US Patent US10100049 Publication Date 10/16/2018
 
Tyrosine-protein kinase JAK2
Name:Tyrosine-protein kinase JAK2
Type:Protein
Mol. Mass.:130684.68
Organism:Homo sapiens (Human)
Description:O60674
Residue:1132
BDBM292120
NameBDBM292120
Synonyms:US10100049, Example 1-1
TypeSmall organic molecule
Emp. Form.C27H31FN6O2
Mol. Mass.490.5724
SMILESCCc1cc(O)c(F)cc1-c1ccc2c(n[nH]c2c1)-c1nc2CN(CCc2[nH]1)C1CN(CCO)C1C