Reaction Details
TargetGlucose-6-phosphate 1-dehydrogenase
LigandBDBM97162
Substrate/Competitorn/a
Meas. Tech.In Vitro Inhibition Assay
Ki 8.2081e+6± 1.3522e+6 nM
IC50 8.110e+6±n/a nM
Citation Akkemik, EBudak, HCiftci, M Effects of some drugs on human erythrocyte glucose 6-phosphate dehydrogenase: an in vitro study. J Enzyme Inhib Med Chem25:871-5 (2010) 
 
Glucose-6-phosphate 1-dehydrogenase
Name:Glucose-6-phosphate 1-dehydrogenase
Type:Enzyme
Mol. Mass.:59258.58
Organism:Homo sapiens (Human)
Description:P11413
Residue:515
BDBM97162
NameBDBM97162
Synonyms:MLS002153782 RITODRINE HYDROCHLORIDE cid_31728
TypeSmall organic molecule
Emp. Form.C17H21NO3
Mol. Mass.287.3535
SMILESC[C@H](NCCc1ccc(O)cc1)[C@H](O)c1ccc(O)cc1