Reaction Details
TargetSerine protease 1
LigandBDBM234266
Substrate/Competitorn/a
Meas. Tech.Inhibition Assay
pH8±n/a
Ki 0.24±n/a nM
Commentsextracted
Citation Suzuki, TKoshiba, TTokumasu, MOhsumi, K Heterocyclic carboxylic acid ester derivative US Patent US9346821 Publication Date 5/24/2016
 
Serine protease 1
Name:Serine protease 1
Type:Enzyme
Mol. Mass.:26557.80
Organism:Homo sapiens (Human)
Description:P07477
Residue:247
BDBM234266
NameBDBM234266
Synonyms:US9346821, B-55
TypeSmall organic molecule
Emp. Form.C20H19FN4O7S
Mol. Mass.478.451
SMILESNC(=N)c1ccc(OC(=O)c2cc3CCN(Cc3s2)C(=O)N[C@@H](CC(O)=O)C(O)=O)c(F)c1