Reaction Details
TargetSeed linoleate 9S-lipoxygenase-3
LigandBDBM50164168
Substrate/Competitorn/a
Meas. Tech.Lipoxygenase Activity Assay
pH9±n/a
Temperature274.15±n/a K
IC50 34100±2100 nM
Commentsextracted
Citation Sadeghian, HSeyedi, SMAttaran, NJabbari, AJafari, Z Synthesis and SAR comparative studies of 2-allyl-4-methoxy-1-alkoxybenzenes as 15-lipoxygenase inhibitors. J Enzyme Inhib Med Chem26:238-44 (2011) 
 
Seed linoleate 9S-lipoxygenase-3
Name:Seed linoleate 9S-lipoxygenase-3
Type:Enzyme
Mol. Mass.:96760.05
Organism:Glycine max (Soybean)
Description:P09186
Residue:857
BDBM50164168
NameBDBM50164168
Synonyms:1,3,4-Eugenol 1-Hydroxy-2-methoxy-4-prop-2-enylbenzene 1-allyl-3-methoxy-4-hydroxybenzene 2-Hydroxy-5-allylanisole 2-Methoxy-4-allylphenol 2-methoxy-4-(prop-2-en-1-yl)phenol4-allyl-2-methoxyphenol 4-Allylcatechol-2-methyl ether 4-Hydroxy-3-methoxy-1-allylbenzene CHEMBL42710 Eugenic acid p-Allylguaiacol | p-Eugenol
TypeSmall organic molecule
Emp. Form.C10H12O2
Mol. Mass.164.2011
SMILESCOc1cc(CC=C)ccc1O