Reaction Details
TargetEpidermal growth factor receptor
LigandBDBM234389
Substrate/Competitorn/a
Meas. Tech.In Vitro Kinase Assay
pH7±0
IC50>1.0e+4±n/a nM
Citation Han, SYChin, YW A FLT3-inhibitory constituent from the rhizomes of Anemarrhena asphodeloides. J Enzyme Inhib Med Chem26:445-8 (2011) 
 
Epidermal growth factor receptor
Name:Epidermal growth factor receptor
Type:Receptor Kinase Domain
Mol. Mass.:134279.59
Organism:Homo sapiens (Human)
Description:P00533
Residue:1210
BDBM234389
NameBDBM234389
Synonyms:Mangiferin
TypeSmall organic molecule
Emp. Form.C19H18O11
Mol. Mass.422.3396
SMILESOC[C@H]1OC([C@H](O)[C@@H](O)[C@@H]1O)c1c(O)cc2oc3cc(O)c(O)cc3c(=O)c2c1O