Reaction Details
TargetSeed linoleate 13S-lipoxygenase-1
LigandBDBM234409
Substrate/Competitorn/a
Meas. Tech.LOX Activity Assay
Temperature298.15±n/a K
IC50 1.2e+3±n/a nM
Commentsextracted
Citation Georgiou, EMetsios, AKourkoumelis, NKarkabounas, SCharalabopoulos, KBadeka, AHadjikakou, SK Inhibition of lipoxygenase (LOX) and anticancer activity caused by gold(I) mixed ligands complexes of triphenylphosphine and thioamides. J Enzyme Inhib Med Chem26:592-7 (2011) 
 
Seed linoleate 13S-lipoxygenase-1
Name:Seed linoleate 13S-lipoxygenase-1
Type:Enzyme
Mol. Mass.:94365.66
Organism:Glycine max (soybean)
Description:n/a
Residue:839
BDBM234409
NameBDBM234409
Synonyms:[Au(tpp)Cl] (1)
TypeSmall organic molecule
Emp. Form.C18H16AuClP
Mol. Mass.495.713
SMILESCl[Au]P(c1ccccc1)(c1ccccc1)c1ccccc1