Reaction Details
TargetL-lactate dehydrogenase B chain
LigandBDBM234447
Substrate/Competitorn/a
Meas. Tech.LDH Activity Assay
pH7.4±n/a
IC50 14500000±n/a nM
Commentsextracted
Citation Rodríguez-Páez, LChena-Taboada, MACabrera-Hernández, ACordero-Martínez, JWong, C Oxamic acid analogues as LDH-C4-specific competitive inhibitors. J Enzyme Inhib Med Chem26:579-86 (2011) 
 
L-lactate dehydrogenase B chain
Name:L-lactate dehydrogenase B chain
Type:Enzyme
Mol. Mass.:36569.37
Organism:Mus musculus (Mouse)
Description:P16125
Residue:334
BDBM234447
NameBDBM234447
Synonyms:N-sec-Butyl oxamate
TypeSmall organic molecule
Emp. Form.C6H10NO3
Mol. Mass.144.149
SMILESCCC(C)NC(=O)C([O-])=O