Reaction Details
TargetL-lactate dehydrogenase C chain
LigandBDBM234444
Substrate/Competitorn/a
Meas. Tech.LDH Activity Assay
pH7.4±n/a
IC50 12000±n/a nM
Commentsextracted
Citation Rodríguez-Páez, LChena-Taboada, MACabrera-Hernández, ACordero-Martínez, JWong, C Oxamic acid analogues as LDH-C4-specific competitive inhibitors. J Enzyme Inhib Med Chem26:579-86 (2011) 
 
L-lactate dehydrogenase C chain
Name:L-lactate dehydrogenase C chain
Type:Enzyme
Mol. Mass.:35917.99
Organism:Mus musculus (Mouse)
Description:P00342
Residue:332
BDBM234444
NameBDBM234444
Synonyms:N-Propyl oxamate
TypeSmall organic molecule
Emp. Form.C5H8NO3
Mol. Mass.130.1225
SMILESCCCNC(=O)C([O-])=O