Reaction Details
TargetFatty acid-binding protein, adipocyte
LigandBDBM234681
Substrate/Competitorn/a
Meas. Tech.Time Resolved-Fluorescence Energy Transfer (TR-FRET) Assay
pH7.5±n/a
IC50 10±n/a nM
Commentsextracted
Citation Buettelmann, BCeccarelli, SMKuehne, HKuhn, BNeidhart, WObst Sander, URichter, H Non-annulated thiophenylamides US Patent US9353102 Publication Date 5/31/2016
 
Fatty acid-binding protein, adipocyte
Name:Fatty acid-binding protein, adipocyte
Type:Enzyme
Mol. Mass.:14719.23
Organism:Homo sapiens (Human)
Description:P15090
Residue:132
BDBM234681
NameBDBM234681
Synonyms:US9353102, 4.5
TypeSmall organic molecule
Emp. Form.C18H19N3O4S
Mol. Mass.373.426
SMILESCc1sc(NC(=O)C2=C(CCC2)C(O)=O)c(c1C)-c1nc(no1)C1CC1