Reaction Details
TargetFatty acid-binding protein, adipocyte
LigandBDBM234709
Substrate/Competitorn/a
Meas. Tech.Time Resolved-Fluorescence Energy Transfer (TR-FRET) Assay
pH7.5±n/a
IC50 13±n/a nM
Commentsextracted
Citation Buettelmann, BCeccarelli, SMKuehne, HKuhn, BNeidhart, WObst Sander, URichter, H Non-annulated thiophenylamides US Patent US9353102 Publication Date 5/31/2016
 
Fatty acid-binding protein, adipocyte
Name:Fatty acid-binding protein, adipocyte
Type:Enzyme
Mol. Mass.:14719.23
Organism:Homo sapiens (Human)
Description:P15090
Residue:132
BDBM234709
NameBDBM234709
Synonyms:US9353102, 4.15
TypeSmall organic molecule
Emp. Form.C23H25N3O3S2
Mol. Mass.455.593
SMILESCc1c(sc(NC(=O)C2=C(C3CCC2CC3)C(O)=O)c1-c1nc(ns1)C1CC1)C1CC1