Reaction Details
TargetCalcium/calmodulin-dependent protein kinase type II subunit delta
LigandBDBM292529
Substrate/Competitorn/a
Meas. Tech.CaMKII Cell-Based Activity
EC50 9.83±n/a nM
Citation Elzein, EKalla, RVKoltun, DLi, XParkhill, EQPerry, TSimonovich, SPZablocki, JZiebenhaus, CA Fused heterocyclic compounds as CaM kinase inhibitors US Patent US10100058 Publication Date 10/16/2018
 
Calcium/calmodulin-dependent protein kinase type II subunit delta
Name:Calcium/calmodulin-dependent protein kinase type II subunit delta
Type:Enzyme Catalytic Domain
Mol. Mass.:56419.78
Organism:Homo sapiens (Human)
Description:Q13557
Residue:499
BDBM292529
NameBDBM292529
Synonyms:(S)-N-(2-(diethylamino)propyl)-2-(3-ethylureido)-6-(5-(thiophen-2-yl)pyrazolo[1,5-a]pyrimidin-3-yl)isonicotinamide | US10100058, Example 185
TypeSmall organic molecule
Emp. Form.C26H32N8O2S
Mol. Mass.520.65
SMILESCCNC(=O)Nc1cc(cc(n1)-c1cnn2ccc(nc12)-c1cccs1)C(=O)NC[C@H](C)N(CC)CC