Reaction Details
TargetCalcium/calmodulin-dependent protein kinase type II subunit delta
LigandBDBM292659
Substrate/Competitorn/a
Meas. Tech.CaMKII delta Biochemical Assay
IC50 0.070±n/a nM
Citation Elzein, EKalla, RVKoltun, DLi, XParkhill, EQPerry, TSimonovich, SPZablocki, JZiebenhaus, CA Fused heterocyclic compounds as CaM kinase inhibitors US Patent US10100058 Publication Date 10/16/2018
 
Calcium/calmodulin-dependent protein kinase type II subunit delta
Name:Calcium/calmodulin-dependent protein kinase type II subunit delta
Type:Enzyme Catalytic Domain
Mol. Mass.:56419.78
Organism:Homo sapiens (Human)
Description:Q13557
Residue:499
BDBM292659
NameBDBM292659
Synonyms:N-((S)-2-(diethylamino)propyl)-2-((S)-3-hydroxypyrrolidin-1-yl)-6-(5-(thiophen-2-yl)pyrazolo[1,5-a]pyrimidin-3-yl)isonicotinamide | US10100058, Example 315
TypeSmall organic molecule
Emp. Form.C27H33N7O2S
Mol. Mass.519.662
SMILESCCN(CC)[C@@H](C)CNC(=O)c1cc(nc(c1)-c1cnn2ccc(nc12)-c1cccs1)N1CC[C@H](O)C1