Reaction Details
TargetCalcium/calmodulin-dependent protein kinase type II subunit delta
LigandBDBM292685
Substrate/Competitorn/a
Meas. Tech.CaMKII delta Biochemical Assay
IC50 0.150±n/a nM
Citation Elzein, EKalla, RVKoltun, DLi, XParkhill, EQPerry, TSimonovich, SPZablocki, JZiebenhaus, CA Fused heterocyclic compounds as CaM kinase inhibitors US Patent US10100058 Publication Date 10/16/2018
 
Calcium/calmodulin-dependent protein kinase type II subunit delta
Name:Calcium/calmodulin-dependent protein kinase type II subunit delta
Type:Enzyme Catalytic Domain
Mol. Mass.:56419.78
Organism:Homo sapiens (Human)
Description:Q13557
Residue:499
BDBM292685
NameBDBM292685
Synonyms:(S)-2-(1-(2-cyanoethyl)-1H-pyrazol-4-yl)-N-(2-(diethylamino)propyl)-6-(5-(thiophen-2-yl)pyrazolo[1,5-a]pyrimidin-3-yl)isonicotinamide | US10100058, Example 341
TypeSmall organic molecule
Emp. Form.C29H31N9OS
Mol. Mass.553.681
SMILESCCN(CC)[C@@H](C)CNC(=O)c1cc(nc(c1)-c1cnn2ccc(nc12)-c1cccs1)-c1cnn(CCC#N)c1