Reaction Details
TargetCalcium/calmodulin-dependent protein kinase type II subunit delta
LigandBDBM292691
Substrate/Competitorn/a
Meas. Tech.CaMKII delta Biochemical Assay
IC50 0.100±n/a nM
Citation Elzein, EKalla, RVKoltun, DLi, XParkhill, EQPerry, TSimonovich, SPZablocki, JZiebenhaus, CA Fused heterocyclic compounds as CaM kinase inhibitors US Patent US10100058 Publication Date 10/16/2018
 
Calcium/calmodulin-dependent protein kinase type II subunit delta
Name:Calcium/calmodulin-dependent protein kinase type II subunit delta
Type:Enzyme Catalytic Domain
Mol. Mass.:56419.78
Organism:Homo sapiens (Human)
Description:Q13557
Residue:499
BDBM292691
NameBDBM292691
Synonyms:(S)-N-(2-(diethylamino)propyl)-2-(2-(diethylamino)ethoxy)-6-(5-(thiophen-2-yl)pyrazolo[1,5-a]pyrimidin-3-yl)isonicotinamide | US10100058, Example 347
TypeSmall organic molecule
Emp. Form.C27H35N7O2S
Mol. Mass.521.678
SMILESCCN(CC)[C@@H](C)CNC(=O)c1cc(OCCN(C)C)nc(c1)-c1cnn2ccc(nc12)-c1cccs1