Reaction Details
TargetIsoform 10 of cAMP-specific 3',5'-cyclic phosphodiesterase 4D (10)
LigandBDBM135812
Substrate/Competitorn/a
Meas. Tech.TR-FRET-Based Assay
Temperature303.15±n/a K
IC50 25000±n/a nM
Commentsextracted
Citation Mjalli, AMGaddam, BPolisetti, DRKostura, MJGuzel, M Tricyclic compounds as modulators of TNF-alpha synthesis and as PDE4 inhibitors US Patent US9393245 Publication Date 7/19/2016
 
Isoform 10 of cAMP-specific 3',5'-cyclic phosphodiesterase 4D (10)
Name:Isoform 10 of cAMP-specific 3',5'-cyclic phosphodiesterase 4D (10)
Type:Enzyme
Mol. Mass.:68570.22
Organism:Homo sapiens (Human)
Description:Q08499-3
Residue:604
BDBM135812
NameBDBM135812
Synonyms:US10085990, Example 30 US8853226, 30 US9833457, 30
TypeSmall organic molecule
Emp. Form.C18H18ClN3O2
Mol. Mass.343.807
SMILESCCn1c(=O)n(C2CCCC2)c2c3cccc(Cl)c3ncc2c1=O