Reaction Details
TargetIsoform 10 of cAMP-specific 3',5'-cyclic phosphodiesterase 4D (10)
LigandBDBM135815
Substrate/Competitorn/a
Meas. Tech.TR-FRET-Based Assay
Temperature303.15±n/a K
IC50 616±n/a nM
Commentsextracted
Citation Mjalli, AMGaddam, BPolisetti, DRKostura, MJGuzel, M Tricyclic compounds as modulators of TNF-alpha synthesis and as PDE4 inhibitors US Patent US9393245 Publication Date 7/19/2016
 
Isoform 10 of cAMP-specific 3',5'-cyclic phosphodiesterase 4D (10)
Name:Isoform 10 of cAMP-specific 3',5'-cyclic phosphodiesterase 4D (10)
Type:Enzyme
Mol. Mass.:68570.22
Organism:Homo sapiens (Human)
Description:Q08499-3
Residue:604
BDBM135815
NameBDBM135815
Synonyms:US10085990, Example 51 US8853226, 51 US9833457, 51
TypeSmall organic molecule
Emp. Form.C22H21N3O3S
Mol. Mass.407.485
SMILESCOc1cccc2c1ncc1c2n(C2CCCC2)c(=O)n(-c2cc(C)cs2)c1=O