Reaction Details
TargetIsoform 10 of cAMP-specific 3',5'-cyclic phosphodiesterase 4D (10)
LigandBDBM135816
Substrate/Competitorn/a
Meas. Tech.TR-FRET-Based Assay
Temperature303.15±n/a K
IC50 338±n/a nM
Commentsextracted
Citation Mjalli, AMGaddam, BPolisetti, DRKostura, MJGuzel, M Tricyclic compounds as modulators of TNF-alpha synthesis and as PDE4 inhibitors US Patent US9393245 Publication Date 7/19/2016
 
Isoform 10 of cAMP-specific 3',5'-cyclic phosphodiesterase 4D (10)
Name:Isoform 10 of cAMP-specific 3',5'-cyclic phosphodiesterase 4D (10)
Type:Enzyme
Mol. Mass.:68570.22
Organism:Homo sapiens (Human)
Description:Q08499-3
Residue:604
BDBM135816
NameBDBM135816
Synonyms:US10085990, Example 54 US8853226, 54 US9833457, 54
TypeSmall organic molecule
Emp. Form.C24H23N3O3
Mol. Mass.401.4577
SMILESCOc1cccc2c1ncc1c2n(C2CCCC2)c(=O)n(-c2cccc(C)c2)c1=O