Reaction Details
TargetIsoform 10 of cAMP-specific 3',5'-cyclic phosphodiesterase 4D (10)
LigandBDBM135824
Substrate/Competitorn/a
Meas. Tech.TR-FRET-Based Assay
Temperature303.15±n/a K
IC50 73±n/a nM
Commentsextracted
Citation Mjalli, AMGaddam, BPolisetti, DRKostura, MJGuzel, M Tricyclic compounds as modulators of TNF-alpha synthesis and as PDE4 inhibitors US Patent US9393245 Publication Date 7/19/2016
 
Isoform 10 of cAMP-specific 3',5'-cyclic phosphodiesterase 4D (10)
Name:Isoform 10 of cAMP-specific 3',5'-cyclic phosphodiesterase 4D (10)
Type:Enzyme
Mol. Mass.:68570.22
Organism:Homo sapiens (Human)
Description:Q08499-3
Residue:604
BDBM135824
NameBDBM135824
Synonyms:US10085990, Example 127 US8853226, 127 US9833457, 127
TypeSmall organic molecule
Emp. Form.C25H25ClN4O5S
Mol. Mass.529.008
SMILESCOc1cccc2c1ncc1c2n(C2CC[C@@H](CC2)NS(C)(=O)=O)c(=O)n(-c2cccc(Cl)c2)c1=O