Reaction Details
TargetCarbonic anhydrase 2
LigandBDBM36071
Substrate/Competitorn/a
Meas. Tech.CA Inhibition Assay
pH7.4±n/a
Ki 4680±n/a nM
Commentsextracted
Citation Cavdar, HEkinci, DTalaz, OSaraçoglu, NSentürk, MSupuran, CT a-Carbonic anhydrases are sulfatases with cyclic diol monosulfate esters. J Enzyme Inhib Med Chem27:148-54 (2012) 
 
Carbonic anhydrase 2
Name:Carbonic anhydrase 2
Type:Enzyme
Mol. Mass.:29250.71
Organism:Homo sapiens (Human)
Description:P00918
Residue:260
BDBM36071
NameBDBM36071
Synonyms:(1R,2R)-trans-1,2-cyclohexanediol | trans-(1R(S),2R(S))-cyclohexane-1,2-diol (10)
TypeGuest
Emp. Form.C6H12O2
Mol. Mass.116.1583
SMILESO[C@@H]1CCCC[C@H]1O