Reaction Details
TargetD(1A) dopamine receptor
LigandBDBM235769
Substrate/Competitorn/a
Meas. Tech.Reception Binding Assay
Temperature303.15±n/a K
Ki 320.11±n/a nM
IC50 648.23±n/a nM
Commentsextracted
Citation Liu, HXie, XZhen, XSun, HLi, JZhu, LLi, ZChen, YJiang, HChen, K Hexahydrodibenzo[a,g]quinolizine compound, preparation method thereof, pharmaceutical composition and use thereof US Patent US9359372 Publication Date 6/7/2016
 
D(1A) dopamine receptor
Name:D(1A) dopamine receptor
Type:Enzyme
Mol. Mass.:49303.43
Organism:Homo sapiens (Human)
Description:P21728
Residue:446
BDBM235769
NameBDBM235769
Synonyms:US9359372, DC037006
TypeSmall organic molecule
Emp. Form.C22H27NO5
Mol. Mass.385.4535
SMILESCOc1cc2CCN3Cc4c(C[C@H]3c2cc1OC)cc(OC)c(OC)c4OC