Reaction Details
TargetD(1A) dopamine receptor
LigandBDBM235771
Substrate/Competitorn/a
Meas. Tech.Reception Binding Assay
Temperature303.15±n/a K
Ki 1003.72±n/a nM
IC50 2032.5±n/a nM
Commentsextracted
Citation Liu, HXie, XZhen, XSun, HLi, JZhu, LLi, ZChen, YJiang, HChen, K Hexahydrodibenzo[a,g]quinolizine compound, preparation method thereof, pharmaceutical composition and use thereof US Patent US9359372 Publication Date 6/7/2016
 
D(1A) dopamine receptor
Name:D(1A) dopamine receptor
Type:Enzyme
Mol. Mass.:49303.43
Organism:Homo sapiens (Human)
Description:P21728
Residue:446
BDBM235771
NameBDBM235771
Synonyms:US9359372, DC037007
TypeSmall organic molecule
Emp. Form.C21H25NO4
Mol. Mass.355.4275
SMILESCOc1ccc2C3Cc4cc(OC)c(OC)c(OC)c4CN3CCc2c1