Reaction Details
TargetD(1A) dopamine receptor
LigandBDBM235770
Substrate/Competitorn/a
Meas. Tech.Reception Binding Assay
Temperature303.15±n/a K
Ki 376.83±n/a nM
IC50 763.07±n/a nM
Commentsextracted
Citation Liu, HXie, XZhen, XSun, HLi, JZhu, LLi, ZChen, YJiang, HChen, K Hexahydrodibenzo[a,g]quinolizine compound, preparation method thereof, pharmaceutical composition and use thereof US Patent US9359372 Publication Date 6/7/2016
 
D(1A) dopamine receptor
Name:D(1A) dopamine receptor
Type:Enzyme
Mol. Mass.:49303.43
Organism:Homo sapiens (Human)
Description:P21728
Residue:446
BDBM235770
NameBDBM235770
Synonyms:US9359372, DC037016
TypeSmall organic molecule
Emp. Form.C21H23NO5
Mol. Mass.369.411
SMILESCOc1cc2C[C@@H]3N(CCc4cc5OCOc5cc34)Cc2c(OC)c1OC